BDBM252447 US9458172, 17
SMILES FC(F)(F)c1cccc(c1)S(=O)(=O)c1ccc(CNC(=O)c2cc3cnccc3[nH]2)nc1
InChI Key InChIKey=FJIFHTXGGJUBAE-UHFFFAOYSA-N
Data  1 IC50
  Tab Delimited (TSV)   2D SDfile   Computed 3D by Vconf -m prep SDfile
Find this compound or compounds like it in BindingDB:
Activity Spreadsheet -- Enzyme Inhibition Constant Data from BindingDB
Found 1 hit for monomerid = 252447
TargetNicotinamide phosphoribosyltransferase(Homo sapiens (Human))
TBA
US Patent
LigandPNGBDBM252447(US9458172, 17)
Affinity DataIC50:  19.1nMpH: 7.5Assay Description:The NAMPT Enzymatic Reaction. The NAMPT enzymatic reactions were carried out in Buffer A (50 mM Hepes pH 7.5, 50 mM NaCl, 5 mM MgCl2, and 1 mM THP) i...
Ligand InfoPC cidPC sid
In DepthDetails US Patent