BDBM252451 US9458172, 21
SMILES FC(F)(F)Oc1cccc(c1)S(=O)(=O)c1ccc(CNC(=O)c2cc3cnccc3[nH]2)nc1
InChI Key InChIKey=PRQWCQPAAYLZFQ-UHFFFAOYSA-N
Data  1 IC50
  Tab Delimited (TSV)   2D SDfile   Computed 3D by Vconf -m prep SDfile
Find this compound or compounds like it in BindingDB:
Activity Spreadsheet -- Enzyme Inhibition Constant Data from BindingDB
Found 1 hit for monomerid = 252451
TargetNicotinamide phosphoribosyltransferase(Homo sapiens (Human))
TBA
US Patent
LigandPNGBDBM252451(US9458172, 21)
Affinity DataIC50:  11.8nMpH: 7.5Assay Description:The NAMPT Enzymatic Reaction. The NAMPT enzymatic reactions were carried out in Buffer A (50 mM Hepes pH 7.5, 50 mM NaCl, 5 mM MgCl2, and 1 mM THP) i...
Ligand InfoPC cidPC sid
In DepthDetails US Patent