BDBM252508 US9458172, 88
SMILES Fc1cc(cc(c1)S(=O)(=O)c1ccc(CNC(=O)c2cc3ccncc3o2)nc1)N1CCOCC1
InChI Key InChIKey=OZLPKLASRYFWEI-UHFFFAOYSA-N
Data  1 IC50
  Tab Delimited (TSV)   2D SDfile   Computed 3D by Vconf -m prep SDfile
Find this compound or compounds like it in BindingDB:
Activity Spreadsheet -- Enzyme Inhibition Constant Data from BindingDB
Found 1 hit for monomerid = 252508
TargetNicotinamide phosphoribosyltransferase(Homo sapiens (Human))
TBA
US Patent
LigandPNGBDBM252508(US9458172, 88)
Affinity DataIC50:  5.90nMpH: 7.5Assay Description:The NAMPT Enzymatic Reaction. The NAMPT enzymatic reactions were carried out in Buffer A (50 mM Hepes pH 7.5, 50 mM NaCl, 5 mM MgCl2, and 1 mM THP) i...
Ligand InfoPC cidPC sid
In DepthDetails US Patent