BDBM25273 3-(decylamino)-1-(2-hydrogen phosphonato-2-phosphonoethyl)pyridin-1-ium::bisphosphonate, 26
SMILES CCCCCCCCCCNc1ccc[n+](CC(P(O)(O)=O)P(O)([O-])=O)c1
InChI Key InChIKey=RVCWWBQTFKGLRM-UHFFFAOYSA-N
Data  1 IC50
  Tab Delimited (TSV)   2D SDfile   Computed 3D by Vconf -m prep SDfile
Find this compound or compounds like it in BindingDB:
Activity Spreadsheet -- Enzyme Inhibition Constant Data from BindingDB
Found 1 hit for monomerid = 25273
TargetGeranylgeranyl pyrophosphate synthase(Homo sapiens (Human))
National Taiwan University
LigandPNGBDBM25273(3-(decylamino)-1-(2-hydrogen phosphonato-2-phospho...)
Affinity DataIC50:  1.26E+3nMpH: 7.0 T: 2°C. Assay description: The inhibitory activity of each test compound was evaluated by monitoring the formation of [14C]GGPP from FPP, using [14C]IPP as the substrate. To co...
Ligand InfoPC cidPC sid
In DepthDetails ArticlePubMed