BDBM252899 US9464076, 51
SMILES CC(=O)c1ccc(C(C)=O)c2c(C)c(sc12)C(=O)Nc1cc(CN2CCC(O)C2)c2ccccc2n1
InChI Key InChIKey=REGXNYBPMNFFCI-UHFFFAOYSA-N
Data  1 IC50
  Tab Delimited (TSV)   2D SDfile   Computed 3D by Vconf -m prep SDfile
Find this compound or compounds like it in BindingDB:
Activity Spreadsheet -- Enzyme Inhibition Constant Data from BindingDB
Found 1 hit for monomerid = 252899
LigandPNGBDBM252899(US9464076, 51)
Affinity DataIC50:  1.5nMpH: 7.5 T: 2°C. Assay description: A human acute lymphoblastic lymphoma T cell line MOLT-4 (which can be purchased under ATCC No. CRL-1582 from ATCC) was cultured in an RPMI1640 medium...
Ligand InfoPC cidPC sid
In DepthDetails US Patent