BDBM252932 US9464076, 84
SMILES COCc1ccc(C(C)=O)c2sc(C(=O)Nc3ccc4c(COC(=O)[C@@H](N)C(C)C)cccc4n3)c(C)c12
InChI Key InChIKey=YXEOFCAGTMFZTC-VWLOTQADSA-N
Data  1 IC50
  Tab Delimited (TSV)   2D SDfile   Computed 3D by Vconf -m prep SDfile
Find this compound or compounds like it in BindingDB:
Activity Spreadsheet -- Enzyme Inhibition Constant Data from BindingDB
Found 1 hit for monomerid = 252932
LigandPNGBDBM252932(US9464076, 84)
Affinity DataIC50:  7.10nMpH: 7.5 T: 2°C. Assay description: A human acute lymphoblastic lymphoma T cell line MOLT-4 (which can be purchased under ATCC No. CRL-1582 from ATCC) was cultured in an RPMI1640 medium...
Ligand InfoKEGGPC cidPC sid
In DepthDetails US Patent