BDBM252976 US9469608, 3-5
SMILES CCOC(=O)c1ccc([nH]1)C(=O)N1CCC[C@H]1C(=O)NCc1cc(Cl)ccc1CN
InChI Key
Data  1 KI
  Tab Delimited (TSV)   2D SDfile   Computed 3D by Vconf -m prep SDfile
Find this compound or compounds like it in BindingDB:
Activity Spreadsheet -- Enzyme Inhibition Constant Data from BindingDB
Found 1 hit for monomerid = 252976
TargetProthrombin(Homo sapiens (Human))
Merck Sharp & Dohme
US Patent
LigandPNGBDBM252976(US9469608, 3-5)
Affinity DataKi:  47nMpH: 7.4Assay Description:Relevant in vitro assays are referenced in Morrissette, et al., Bioorg. Med. Chem. Lett. 2004, 14, 4161-4164 and described in Lewis, et al. Thromb. R...
Ligand InfoPC cidPC sid
In DepthDetails US Patent