BDBM253248 US9458171, 208
SMILES Cc1nonc1CC(=O)N1CC[C@](C1)(c1ccc(cc1)C(OCc1c(F)cccc1F)(C(F)(F)F)C(F)(F)F)S(=O)(=O)c1ccc(F)cc1
InChI Key InChIKey=MCFPBHAUMXJJQT-NDEPHWFRSA-N
Data  1 IC50
  Tab Delimited (TSV)   2D SDfile   Computed 3D by Vconf -m prep SDfile
Find this compound or compounds like it in BindingDB:
Activity Spreadsheet -- Enzyme Inhibition Constant Data from BindingDB
Found 1 hit for monomerid = 253248
TargetNuclear receptor ROR-gamma [262-507](Homo sapiens (Human))
Bristol-Myers Squibb
US Patent
LigandPNGBDBM253248(US9458171, 208)
Affinity DataIC50:  33nMT: 2°C. Assay description: The binding of potential ligands to RORγ is measured by competition with [3H] 25-hydroxycholesterol (Perkin Elmer NET674250UC) using a scintill...
Ligand InfoPC cidPC sid
In DepthDetails US Patent