BDBM253271 US9458171, 231
SMILES Fc1ccc(cc1)S(=O)(=O)[C@]1(CCN(C1)C(=O)N1CC[C@H](C1)C#N)c1ccc(cc1)C(OCc1c(F)cccc1F)(C(F)(F)F)C(F)(F)F
InChI Key InChIKey=ULWFIWXDJILZFM-WRONEBCDSA-N
Data  1 IC50
  Tab Delimited (TSV)   2D SDfile   Computed 3D by Vconf -m prep SDfile
Find this compound or compounds like it in BindingDB:
Activity Spreadsheet -- Enzyme Inhibition Constant Data from BindingDB
Found 1 hit for monomerid = 253271
TargetNuclear receptor ROR-gamma [262-507](Homo sapiens (Human))
Bristol-Myers Squibb
US Patent
LigandPNGBDBM253271(US9458171, 231)
Affinity DataIC50:  23nMT: 2°C. Assay description: The binding of potential ligands to RORγ is measured by competition with [3H] 25-hydroxycholesterol (Perkin Elmer NET674250UC) using a scintill...
Ligand InfoPC cidPC sid
In DepthDetails US Patent