BDBM253647 US10179804, Example 93::US10632171, Peptide No. 93::US9458201, 93
SMILES CC(=O)NCC[C@@H]1NC(=O)[C@H](CC(=O)NCCCC[C@H](NC(=O)[C@H](Cc2c[nH]c3ccccc23)NC(=O)[C@H](CCCNC(N)=N)NC(=O)[C@@H](Cc2ccccc2)NC1=O)C(N)=O)NC(=O)[C@H](CCCNC(N)=N)NC(C)=O
InChI Key
Data  3 KI
  Tab Delimited (TSV)   2D SDfile   Computed 3D by Vconf -m prep SDfile
Find this compound or compounds like it in BindingDB:
Activity Spreadsheet -- Enzyme Inhibition Constant Data from BindingDB
Found 3 hits for monomerid = 253647
TargetMelanocortin receptor 4(Homo sapiens (Human))
Palatin Technologies
US Patent
LigandPNGBDBM253647(US10179804, Example 93 | US10632171, Peptide No. 9...)
Affinity DataKi:  33nM ΔG°:  -10.6kcal/molepH: 7.5 T: 2°C. Assay description: A competitive inhibition binding assay is performed using membrane homogenates prepared from HEK-293 cells that express recombinant hMC4-R, hMC3-R, o...
Ligand InfoPC cidPC sid
In DepthDetails US Patent
TargetMelanocortin receptor 4(Homo sapiens (Human))
Palatin Technologies
US Patent
LigandPNGBDBM253647(US10179804, Example 93 | US10632171, Peptide No. 9...)
Affinity DataKi:  33nM. Assay description: A competitive inhibition binding assay is performed using membrane homogenates prepared from HEK-293 cells that express recombinant hMC4-R, hMC3-R, o...
Ligand InfoPC cidPC sid
In DepthDetails US Patent
TargetMelanocortin receptor 4(Homo sapiens (Human))
Palatin Technologies
US Patent
LigandPNGBDBM253647(US10179804, Example 93 | US10632171, Peptide No. 9...)
Affinity DataKi:  33nM. Assay description: Accumulation of intracellular cAMP was examined as a measure of the ability of the peptides of the present invention to elicit a functional response ...
Ligand InfoPC cidPC sid
In DepthDetails US Patent