BDBM253685 US9459250, A29
SMILES CCCC(CCC)NC(=O)c1ccc2ncoc2c1
InChI Key InChIKey=INNLWYZSTSJZNV-UHFFFAOYSA-N
Data  1 EC50
  Tab Delimited (TSV)   2D SDfile   Computed 3D by Vconf -m prep SDfile
Find this compound or compounds like it in BindingDB:
Activity Spreadsheet -- Enzyme Inhibition Constant Data from BindingDB
Found 1 hit for monomerid = 253685
TargetTaste receptor type 1 member 1/3(Homo sapiens (Human))
Senomyx
US Patent
LigandPNGBDBM253685(US9459250, A29)
Affinity DataEC50:  1.91E+3nMT: 2°C. Assay description: Immunoassays also often use a labeling agent to specifically bind to and label the complex formed by the antibody and antigen. The labeling agent may...
Ligand InfoPC cidPC sid
In DepthDetails US Patent