BDBM253721 US9459250, A65
SMILES COC[C@@H](CC(C)C)NC(=O)c1ccc(SC)c(C)c1
InChI Key InChIKey=GFYUEMJKWMBDHT-CQSZACIVSA-N
Data  1 EC50
  Tab Delimited (TSV)   2D SDfile   Computed 3D by Vconf -m prep SDfile
Find this compound or compounds like it in BindingDB:
Activity Spreadsheet -- Enzyme Inhibition Constant Data from BindingDB
Found 1 hit for monomerid = 253721
TargetTaste receptor type 1 member 1/3(Homo sapiens (Human))
Senomyx
US Patent
LigandPNGBDBM253721(US9459250, A65)
Affinity DataEC50:  290nMT: 2°C. Assay description: Immunoassays also often use a labeling agent to specifically bind to and label the complex formed by the antibody and antigen. The labeling agent may...
Ligand InfoPC cidPC sid
In DepthDetails US Patent