BDBM253836 US9459250, E41
SMILES Cc1c(F)c(F)c(C(=O)N[C@@H]2CC3CCC2C3)c(F)c1F
InChI Key InChIKey=IJMYMZXOHXKQLC-AMDVSUOASA-N
Data  1 EC50
  Tab Delimited (TSV)   2D SDfile   Computed 3D by Vconf -m prep SDfile
Find this compound or compounds like it in BindingDB:
Activity Spreadsheet -- Enzyme Inhibition Constant Data from BindingDB
Found 1 hit for monomerid = 253836
TargetTaste receptor type 1 member 2/3(Homo sapiens (Human))
Senomyx
US Patent
LigandPNGBDBM253836(US9459250, E41)
Affinity DataEC50:  1.02E+3nMT: 2°C. Assay description: Immunoassays also often use a labeling agent to specifically bind to and label the complex formed by the antibody and antigen. The labeling agent may...
Ligand InfoPC cidPC sid
In DepthDetails US Patent