BDBM253918 US9464092, J::US9527857, J
SMILES C[C@@H](O)CN1CCN(C[C@H]1C)c1ccc(Nc2ncc3cc4C(=O)NCC5(CCCCC5)n4c3n2)nc1
InChI Key InChIKey=RLSSWKHNBFFPTF-RTBURBONSA-N
Data  9 IC50
  Tab Delimited (TSV)   2D SDfile   Computed 3D by Vconf -m prep SDfile
Find this compound or compounds like it in BindingDB:
Activity Spreadsheet -- Enzyme Inhibition Constant Data from BindingDB
Found 9 hits for monomerid = 253918
TargetCyclin-dependent kinase 4/G1/S-specific cyclin-D1(Homo sapiens (Human))
G1 Therapeutics
US Patent
LigandPNGBDBM253918(US9464092, J | US9527857, J)
Affinity DataIC50:  0.700nM. Assay description: Selected compounds disclosed herein were tested in CDK4/cyclinD1, CDK6/CycD3 CDK2/CycA and CDK2/cyclinE kinase assays by Nanosyn (Santa Clara, Calif....
Ligand InfoPC cidPC sid
In DepthDetails US Patent
TargetCyclin-dependent kinase 2/G1/S-specific cyclin-E1(Homo sapiens (Human))
G1 Therapeutics
US Patent
LigandPNGBDBM253918(US9464092, J | US9527857, J)
Affinity DataIC50:  5.11E+3nM. Assay description: Selected compounds disclosed herein were tested in CDK4/cyclinD1, CDK6/CycD3 CDK2/CycA and CDK2/cyclinE kinase assays by Nanosyn (Santa Clara, Calif....
Ligand InfoPC cidPC sid
In DepthDetails US Patent
TargetCyclin-A2/Cyclin-dependent kinase 2(Homo sapiens (Human))
G1 Therapeutics
US Patent
LigandPNGBDBM253918(US9464092, J | US9527857, J)
Affinity DataIC50:  4.34E+3nM. Assay description: Selected compounds disclosed herein were tested in CDK4/cyclinD1, CDK6/CycD3 CDK2/CycA and CDK2/cyclinE kinase assays by Nanosyn (Santa Clara, Calif....
Ligand InfoPC cidPC sid
In DepthDetails US Patent
TargetCyclin-dependent kinase 2/G1/S-specific cyclin-E1(Homo sapiens (Human))
G1 Therapeutics
US Patent
LigandPNGBDBM253918(US9464092, J | US9527857, J)
Affinity DataIC50:  5.11E+3nM. Assay description: Selected compounds disclosed herein were tested in CDK4/cyclinD1, CDK2/CycA and CDK2/cyclinE kinase assays by Nanosyn (Santa Clara, Calif.) to determ...
Ligand InfoPC cidPC sid
In DepthDetails US Patent
TargetCyclin-A2/Cyclin-dependent kinase 2(Homo sapiens (Human))
G1 Therapeutics
US Patent
LigandPNGBDBM253918(US9464092, J | US9527857, J)
Affinity DataIC50:  4.34E+3nM. Assay description: Selected compounds disclosed herein were tested in CDK4/cyclinD1, CDK2/CycA and CDK2/cyclinE kinase assays by Nanosyn (Santa Clara, Calif.) to determ...
Ligand InfoPC cidPC sid
In DepthDetails US Patent
TargetCyclin-dependent kinase 4/G1/S-specific cyclin-D1(Homo sapiens (Human))
G1 Therapeutics
US Patent
LigandPNGBDBM253918(US9464092, J | US9527857, J)
Affinity DataIC50:  0.700nM. Assay description: Selected compounds disclosed herein were tested in CDK4/cyclinD1, CDK2/CycA and CDK2/cyclinE kinase assays by Nanosyn (Santa Clara, Calif.) to determ...
Ligand InfoPC cidPC sid
In DepthDetails US Patent
TargetCyclin-dependent kinase 2/G1/S-specific cyclin-E1(Homo sapiens (Human))
G1 Therapeutics
US Patent
LigandPNGBDBM253918(US9464092, J | US9527857, J)
Affinity DataIC50:  5.11E+3nM. Assay description: Selected compounds disclosed herein were tested in CDK4/cyclinD1, CDK2/CycA and CDK2/cyclinE kinase assays by Nanosyn (Santa Clara, Calif.) to determ...
Ligand InfoPC cidPC sid
In DepthDetails US Patent
TargetCyclin-dependent kinase 4/G1/S-specific cyclin-D1(Homo sapiens (Human))
G1 Therapeutics
US Patent
LigandPNGBDBM253918(US9464092, J | US9527857, J)
Affinity DataIC50:  0.700nM. Assay description: Selected compounds disclosed herein were tested in CDK4/cyclinD1, CDK2/CycA and CDK2/cyclinE kinase assays by Nanosyn (Santa Clara, Calif.) to determ...
Ligand InfoPC cidPC sid
In DepthDetails US Patent
TargetCyclin-A1/Cyclin-dependent kinase 2(Homo sapiens (Human))
Gi Therapeutics
US Patent
LigandPNGBDBM253918(US9464092, J | US9527857, J)
Affinity DataIC50:  4.34E+3nM. Assay description: Selected compounds disclosed herein were tested in CDK4/cyclinD1, CDK2/CycA and CDK2/cyclinE kinase assays by Nanosyn (Santa Clara, Calif.) to determ...
Ligand InfoPC cidPC sid
In DepthDetails US Patent