BDBM254031 US9493430, 561
SMILES COc1ccc(cc1C1=C(CN2[C@@H](C)[C@H](OC2=O)c2cc(cc(c2)C(F)(F)F)C(F)(F)F)CC(C)(C)CC1)-c1ccc(cc1F)C(O)=O
InChI Key InChIKey=RTFDMJGBAGGVDH-PBYQXAPXSA-N
Data  1 IC50
  Tab Delimited (TSV)   2D SDfile   Computed 3D by Vconf -m prep SDfile
Find this compound or compounds like it in BindingDB:
Activity Spreadsheet -- Enzyme Inhibition Constant Data from BindingDB
Found 1 hit for monomerid = 254031
TargetCholesteryl ester transfer protein(Homo sapiens (Human))
Chong Kun Dang Pharmaceutical
US Patent
LigandPNGBDBM254031(US9493430, 561)
Affinity DataIC50:  23.2nM. Assay description: As a protein source for cholesteryl ester transfer, plasma from healthy persons was used, and as a cholesteryl ester receptor, LDL from healthy perso...
Ligand InfoPC cidPC sid
In DepthDetails US Patent