BDBM254107 US9481677, 35
SMILES Fc1cc(c(F)cc1Oc1ccc(Cl)cc1-c1c[nH]c(=O)c2cncn12)S(=O)(=O)Nc1ncns1
InChI Key InChIKey=FDNUZWJGGGHNEE-UHFFFAOYSA-N
Data  1 IC50
  Tab Delimited (TSV)   2D SDfile   Computed 3D by Vconf -m prep SDfile
Find this compound or compounds like it in BindingDB:
Activity Spreadsheet -- Enzyme Inhibition Constant Data from BindingDB
Found 1 hit for monomerid = 254107
TargetSodium channel protein type 9 subunit alpha(Homo sapiens (Human))
Xenon Pharmaceuticals
US Patent
LigandPNGBDBM254107(US9481677, 35)
Affinity DataIC50:  675nM. Assay description: Patch voltage clamp electrophysiology allows for the direct measurement and quantification of block of voltage-gated sodium channels (Nav's), and...
Ligand InfoPC cidPC sid
In DepthDetails US Patent