BDBM254627 US9469631, 24
SMILES Cc1cc(ccc1-c1cnco1)C(=O)N(C1CC1)C1CCN(CC1)C(=O)OC(C)(C)C
InChI Key InChIKey=PBEHGIOEQIXQRX-UHFFFAOYSA-N
Data  1 EC50
  Tab Delimited (TSV)   2D SDfile   Computed 3D by Vconf -m prep SDfile
Find this compound or compounds like it in BindingDB:
Activity Spreadsheet -- Enzyme Inhibition Constant Data from BindingDB
Found 1 hit for monomerid = 254627
TargetGlucose-dependent insulinotropic receptor(Homo sapiens (Human))
Boehringer Ingelheim International
US Patent
LigandPNGBDBM254627(US9469631, 24)
Affinity DataEC50:  81nMpH: 7.4 T: 2°C. Assay description: MIN6 cells [Miyazaki J et al. Endocrinology. 1990 July; 127(1):126-32] are stably transfected with an expression vector for human GPR119 cDNA (Acc. N...
Ligand InfoPC cidPC sid
In DepthDetails US Patent