BDBM254726 US9469631, 127
SMILES C=CCOC(=O)N1CCC(CC1)N(C1CC1)C(=O)c1ccc(cc1)-c1cnco1
InChI Key InChIKey=WCDXCFCYJJGZMM-UHFFFAOYSA-N
Data  1 EC50
  Tab Delimited (TSV)   2D SDfile   Computed 3D by Vconf -m prep SDfile
Find this compound or compounds like it in BindingDB:
Activity Spreadsheet -- Enzyme Inhibition Constant Data from BindingDB
Found 1 hit for monomerid = 254726
TargetGlucose-dependent insulinotropic receptor(Homo sapiens (Human))
Boehringer Ingelheim International
US Patent
LigandPNGBDBM254726(US9469631, 127)
Affinity DataEC50:  102nMpH: 7.4 T: 2°C. Assay description: MIN6 cells [Miyazaki J et al. Endocrinology. 1990 July; 127(1):126-32] are stably transfected with an expression vector for human GPR119 cDNA (Acc. N...
Ligand InfoPC cidPC sid
In DepthDetails US Patent