BDBM254792 US9475775, 59::US9597333, 59
SMILES CCCN(CCC)C(=O)C1=Cc2ccc(cc2N=C(N)C1)C(=O)Nc1cccc(CCCN)c1
InChI Key InChIKey=QKPZDKQWNSDNAR-UHFFFAOYSA-N
Data  4 EC50
  Tab Delimited (TSV)   2D SDfile   Computed 3D by Vconf -m prep SDfile
Find this compound or compounds like it in BindingDB:
Activity Spreadsheet -- Enzyme Inhibition Constant Data from BindingDB
Found 4 hits for monomerid = 254792
TargetToll-like receptor 8(Homo sapiens (Human))
Hoffmann-La Roche
US Patent
LigandPNGBDBM254792(US9475775, 59 | US9597333, 59)
Affinity DataEC50:  3nM. Assay description: For TLR8 and TLR7 activity testing, HEK-Blue human TLR8 or TLR7 cells (Invivogen, San Diego, Calif., USA) are used, respectively. These cells are des...
Ligand InfoPC cidPC sid
In DepthDetails US Patent
TargetToll-like receptor 7(Homo sapiens (Human))
Hoffmann-La Roche
US Patent
LigandPNGBDBM254792(US9475775, 59 | US9597333, 59)
Affinity DataEC50: >1.00E+5nM. Assay description: For TLR8 and TLR7 activity testing, HEK-Blue human TLR8 or TLR7 cells (Invivogen, San Diego, Calif., USA) are used, respectively. These cells are des...
Ligand InfoPC cidPC sid
In DepthDetails US Patent
TargetToll-like receptor 8(Homo sapiens (Human))
Hoffmann-La Roche
US Patent
LigandPNGBDBM254792(US9475775, 59 | US9597333, 59)
Affinity DataEC50:  3nM. Assay description: For TLR8 and TLR7 activity testing, HEK-Blue human TLR8 or TLR7 cells (Invivogen, San Diego, Calif., USA) are used, respectively. These cells are des...
Ligand InfoPC cidPC sid
In DepthDetails US Patent
TargetToll-like receptor 7(Homo sapiens (Human))
Hoffmann-La Roche
US Patent
LigandPNGBDBM254792(US9475775, 59 | US9597333, 59)
Affinity DataEC50: >1.00E+5nM. Assay description: For TLR8 and TLR7 activity testing, HEK-Blue human TLR8 or TLR7 cells (Invivogen, San Diego, Calif., USA) are used, respectively. These cells are des...
Ligand InfoPC cidPC sid
In DepthDetails US Patent