BDBM254915 US9493483, 403
SMILES Cc1noc2[C@H](CC(N)=O)N=C(c3ccc(Cl)cc3)c3cc(ccc3-c12)-c1ccc(C)nc1
InChI Key InChIKey=GEAHCEHFMIOCKR-QFIPXVFZSA-N
Data  1 IC50
  Tab Delimited (TSV)   2D SDfile   Computed 3D by Vconf -m prep SDfile
Find this compound or compounds like it in BindingDB:
Activity Spreadsheet -- Enzyme Inhibition Constant Data from BindingDB
Found 1 hit for monomerid = 254915
TargetBromodomain-containing protein 4 [42-168](Homo sapiens (Human))
Constellation Pharmaceuticals
US Patent
LigandPNGBDBM254915(US9493483, 403)
Affinity DataIC50:  28nMpH: 7.0 T: 2°C. Assay description: His/Flag epitope tagged BRD4 BD142-168 was cloned, expressed and purified to homogeneity. BRD4 binding and inhibition was assessed by monitoring the ...
Ligand InfoPC cidPC sid
In DepthDetails US Patent