BDBM254943 US9505765, 21
SMILES CC(C)COc1ncnc2[nH]cc(C(C)=O)c12
InChI Key InChIKey=KBABZWSSGPHXJR-UHFFFAOYSA-N
Data  1 IC50
  Tab Delimited (TSV)   2D SDfile   Computed 3D by Vconf -m prep SDfile
Find this compound or compounds like it in BindingDB:
Activity Spreadsheet -- Enzyme Inhibition Constant Data from BindingDB
Found 1 hit for monomerid = 254943
LigandPNGBDBM254943(US9505765, 21)
Affinity DataIC50:  1.70E+3nM. Assay description: TAK1-TAB1 Binding Inhibitory Potency: The ability of candidate compounds to interact with TAK1-TAB1 is quantitated by a competitive binding assay usi...
Ligand InfoPC cidPC sid
In DepthDetails US Patent