BDBM254965 US9505765, 189
SMILES CCCOc1ncnc2[nH]cc(\C=C\C(N)=O)c12
InChI Key InChIKey=PZPZZBSXXDLNMN-ONEGZZNKSA-N
Data  1 IC50
  Tab Delimited (TSV)   2D SDfile   Computed 3D by Vconf -m prep SDfile
Find this compound or compounds like it in BindingDB:
Activity Spreadsheet -- Enzyme Inhibition Constant Data from BindingDB
Found 1 hit for monomerid = 254965
LigandPNGBDBM254965(US9505765, 189)
Affinity DataIC50:  19nM. Assay description: TAK1-TAB1 Binding Inhibitory Potency: The ability of candidate compounds to interact with TAK1-TAB1 is quantitated by a competitive binding assay usi...
Ligand InfoPC cidPC sid
In DepthDetails US Patent