BDBM254977 US9505765, 201
SMILES COC(=O)\C=C\c1c[nH]c2ncnc(OCc3ccccc3)c12
InChI Key InChIKey=DSQSRIOQMWVLNQ-BQYQJAHWSA-N
Data  1 IC50
  Tab Delimited (TSV)   2D SDfile   Computed 3D by Vconf -m prep SDfile
Find this compound or compounds like it in BindingDB:
Activity Spreadsheet -- Enzyme Inhibition Constant Data from BindingDB
Found 1 hit for monomerid = 254977
LigandPNGBDBM254977(US9505765, 201)
Affinity DataIC50:  350nM. Assay description: TAK1-TAB1 Binding Inhibitory Potency: The ability of candidate compounds to interact with TAK1-TAB1 is quantitated by a competitive binding assay usi...
Ligand InfoPC cidPC sid
In DepthDetails US Patent