BDBM255048 US9475817, 4
SMILES Cc1nc(sc1C(=O)Nc1cn2nc(ccc2n1)-c1cn(C)nc1-c1ccc(F)cc1)-c1ccncc1
InChI Key InChIKey=SSYURUKRNJONCG-UHFFFAOYSA-N
Data  2 IC50
  Tab Delimited (TSV)   2D SDfile   Computed 3D by Vconf -m prep SDfile
Find this compound or compounds like it in BindingDB:
Activity Spreadsheet -- Enzyme Inhibition Constant Data from BindingDB
Found 2 hits for monomerid = 255048
TargetCasein kinase I isoform delta(Homo sapiens (Human))
Bristol-Myers Squibb
US Patent
LigandPNGBDBM255048(US9475817, 4)
Affinity DataIC50:  3.70nMpH: 7.4 T: 2°C. Assay description: The kinase assay was performed in V-bottom 384-well plates. The final assay volume was 30 ul prepared from 15 ul additions of enzyme, substrates (flu...
Ligand InfoPC cidPC sid
In DepthDetails US Patent
TargetCasein kinase I isoform epsilon(Homo sapiens (Human))
Bristol-Myers Squibb
US Patent
LigandPNGBDBM255048(US9475817, 4)
Affinity DataIC50:  13.7nMpH: 7.4 T: 2°C. Assay description: The kinase assay was performed in V-bottom 384-well plates. The final assay volume was 30 ul prepared from 15 ul additions of enzyme, substrates (flu...
Ligand InfoPC cidPC sid
In DepthDetails US Patent