BDBM25527 12,14-dioxa-8-azatetracyclo[8.7.0.0^{2,7}.0^{11,15}]heptadeca-1(10),2(7),3,5,8,11(15),16-heptaene::phenanthridine::sanguinarine analogue, 12
SMILES C1Oc2ccc3c(cnc4ccccc34)c2O1
InChI Key InChIKey=BDHOVBWCQYUPEN-UHFFFAOYSA-N
Data  1 IC50
  Tab Delimited (TSV)   2D SDfile   Computed 3D by Vconf -m prep SDfile
Find this compound or compounds like it in BindingDB:
Activity Spreadsheet -- Enzyme Inhibition Constant Data from BindingDB
Found 1 hit for monomerid = 25527
TargetBcl-2-like protein 1(Homo sapiens (Human))
A* Star
LigandPNGBDBM25527(12,14-dioxa-8-azatetracyclo[8.7.0.0^{2,7}.0^{11,15...)
Affinity DataIC50: >1.00E+5nMpH: 8.0 T: 2°C. Assay description: In the fluorescence polarization assay, the Bcl-XL protein is incubated with a fluorescein-tagged Bak-BH3 peptide. The Bcl-XL:Bak-BH3 peptide complex...
In DepthDetails ArticlePubMed