BDBM2553 US8507510, 1.44
SMILES C[C@H](O)[C@@H](C)Nc1nc(Nc2ccc(cc2)S(C)(=N)=O)ncc1Br
InChI Key InChIKey=QFUXJZMXUXQIIB-FVOQNFDRSA-N
Data  2 IC50
  Tab Delimited (TSV)   2D SDfile   Computed 3D by Vconf -m prep SDfile
Find this compound or compounds like it in BindingDB:
Activity Spreadsheet -- Enzyme Inhibition Constant Data from BindingDB
Found 2 hits for monomerid = 2553
TargetCyclin-dependent kinase 2(Homo sapiens (Human))
Bayer Intellectual Property
US Patent
LigandPNGBDBM2553(US8507510, 1.44)
Affinity DataIC50:  2nM. Assay description: Kinase assay using either CDK1, CDK2 or VEGFR-2.
In DepthDetails US Patent
TargetCyclin-dependent kinase 1(Homo sapiens (Human))
Bayer Intellectual Property
US Patent
LigandPNGBDBM2553(US8507510, 1.44)
Affinity DataIC50:  5nM. Assay description: Kinase assay using either CDK1, CDK2 or VEGFR-2.
In DepthDetails US Patent