BDBM25557 4-arylamino-3-pyridinecarbonitrile, 4o::5-(3,4-dimethoxyphenyl)-4-[(3,4-dimethoxyphenyl)amino]pyridine-3-carbonitrile
SMILES COc1ccc(Nc2c(cncc2-c2ccc(OC)c(OC)c2)C#N)cc1OC
InChI Key InChIKey=VTQQINTUHGYFSB-UHFFFAOYSA-N
Data  1 IC50
  Tab Delimited (TSV)   2D SDfile   Computed 3D by Vconf -m prep SDfile
Find this compound or compounds like it in BindingDB:
Activity Spreadsheet -- Enzyme Inhibition Constant Data from BindingDB
Found 1 hit for monomerid = 25557
TargetProtein kinase C theta type(Homo sapiens (Human))
Wyeth Research
LigandPNGBDBM25557(4-arylamino-3-pyridinecarbonitrile, 4o | 5-(3,4-di...)
Affinity DataIC50:  2.20E+3nMpH: 7.2 T: 2°C. Assay description: All IC50s were measured by using a modified IMAP protocol from Molecular Devices. The kinase reaction was carried out in a Corning Costar 384 well pl...
In DepthDetails ArticlePubMed