BDBM255587 US9499534, 1.8
SMILES CC1(C)C[C@@](O)(CC[C@H]1C(O)=O)c1ncc(s1)-c1cc(Nc2nccc(n2)C(F)(F)F)cc(c1)C#N
InChI Key InChIKey=OKYMOCVPUIQHGN-HJPURHCSSA-N
Data  1 IC50
  Tab Delimited (TSV)   2D SDfile   Computed 3D by Vconf -m prep SDfile
Find this compound or compounds like it in BindingDB:
Activity Spreadsheet -- Enzyme Inhibition Constant Data from BindingDB
Found 1 hit for monomerid = 255587
TargetGlutathione S-transferase P/Tyrosine-protein kinase SYK(Homo sapiens (Human))
Merck Sharp & Dohme
US Patent
LigandPNGBDBM255587(US9499534, 1.8)
Affinity DataIC50:  5.77nMpH: 7.5 T: 2°C. Assay description: A recombinant GST-hSYK fusion protein was used to measure potency of compounds to inhibit human Syk activity. The recombinant human GST-SYK (Carna Bi...
Ligand InfoPC cidPC sid
In DepthDetails US Patent