BDBM255747 US9475815, WO 2007/61737: 233::US9598416, Example 233 W 2007/061737
SMILES Nc1nccn2c(nc(-c3cc4cccc(Cl)c4s3)c12)C1CCC1
InChI Key InChIKey=CGCOISKAJKYNLO-UHFFFAOYSA-N
Data  4 IC50
  Tab Delimited (TSV)   2D SDfile   Computed 3D by Vconf -m prep SDfile
Find this compound or compounds like it in BindingDB:
Activity Spreadsheet -- Enzyme Inhibition Constant Data from BindingDB
Found 4 hits for monomerid = 255747
TargetFibroblast growth factor receptor 1 [400-80]/Glutathione S-transferase P(Homo sapiens (Human))
Bayer Intelletual Property
US Patent
LigandPNGBDBM255747(US9475815, WO 2007/61737: 233 | US9598416, Example...)
Affinity DataIC50:  4.60E+3nMpH: 7.0 T: 2°C. Assay description: A recombinant tagged FGFR-1 fusion protein [fusion of glutathione-S-transferase (GST) (N-terminally), His6-tag, thrombin cleavage site, and the intra...
Ligand InfoPC cidPC sid
In DepthDetails US Patent
TargetFibroblast growth factor receptor 3(Homo sapiens (Human))
Bayer Intellectual Property
US Patent
LigandPNGBDBM255747(US9475815, WO 2007/61737: 233 | US9598416, Example...)
Affinity DataIC50:  1.00E+4nM
Ligand InfoPC cidPC sid
In DepthDetails US Patent
TargetFibroblast growth factor receptor 1(Homo sapiens (Human))
Bayer Intellectual Property
US Patent
LigandPNGBDBM255747(US9475815, WO 2007/61737: 233 | US9598416, Example...)
Affinity DataIC50:  4.60E+3nM. Assay description: Usually, test compounds were tested on the same microtiter plate at 11 different concentrations in the range of 20 μM to 0.1 nM (e.g. 20 μM...
Ligand InfoPC cidPC sid
In DepthDetails US Patent
TargetFibroblast growth factor receptor 3 [397-806]/Glutathione S-transferase P(Homo sapiens (Human))
Bayer Intelletual Property
US Patent
LigandPNGBDBM255747(US9475815, WO 2007/61737: 233 | US9598416, Example...)
Affinity DataIC50:  1.00E+4nMpH: 7.0 T: 2°C. Assay description: A recombinant tagged FGFR-3 fusion protein [fusion of glutathione-S-transferase (GST) (N-terminally), His6-tag, thrombin cleavage site, and the intra...
Ligand InfoPC cidPC sid
In DepthDetails US Patent