BDBM255764 2-((3R,4R)-3-Amino- tetrahydro-pyran-4- ylamino)-thieno[3,2- d]pyrimidine-7-carboxylic acid (1-methyl-1H- pyrazol-3-yl)-amide::US9701691, 19
SMILES Cn1ccc(NC(=O)c2csc3cnc(N[C@@H]4CCOC[C@@H]4N)nc23)n1
InChI Key InChIKey=GBWBYOIYZOJZPL-WDEREUQCSA-N
Data  1 IC50
  Tab Delimited (TSV)   2D SDfile   Computed 3D by Vconf -m prep SDfile
Find this compound or compounds like it in BindingDB:
Activity Spreadsheet -- Enzyme Inhibition Constant Data from BindingDB
Found 1 hit for monomerid = 255764
TargetTyrosine-protein kinase SYK(Homo sapiens (Human))
Hoffmann-La Roche
US Patent
LigandPNGBDBM255764(2-((3R,4R)-3-Amino- tetrahydro-pyran-4- ylamino)-t...)
Affinity DataIC50:  852nM. Assay description: Determination of IC50 of Spleen Tyrosine Kinase (SYK) inhibition: SYK kinase assay is a standard kinase assay adapted to a 96 well plate format. This...
Ligand InfoPC cidPC sid
In DepthDetails US Patent