BDBM255768 2-((3R,4R)-3-Amino- tetrahydro-pyran-4- ylamino)-thieno[3,2- d]pyrimidine-7-carboxylic acid imidazo[1,2- b]pyridazin-3-ylamide::US9701691, 23
SMILES N[C@H]1COCC[C@H]1Nc1ncc2scc(C(=O)Nc3cnc4cccnn34)c2n1
InChI Key InChIKey=ZLUMYWNLERVNJG-NWDGAFQWSA-N
Data  1 IC50
  Tab Delimited (TSV)   2D SDfile   Computed 3D by Vconf -m prep SDfile
Find this compound or compounds like it in BindingDB:
Activity Spreadsheet -- Enzyme Inhibition Constant Data from BindingDB
Found 1 hit for monomerid = 255768
TargetTyrosine-protein kinase SYK(Homo sapiens (Human))
Hoffmann-La Roche
US Patent
LigandPNGBDBM255768(2-((3R,4R)-3-Amino- tetrahydro-pyran-4- ylamino)-t...)
Affinity DataIC50:  560nM. Assay description: Determination of IC50 of Spleen Tyrosine Kinase (SYK) inhibition: SYK kinase assay is a standard kinase assay adapted to a 96 well plate format. This...
Ligand InfoPC cidPC sid
In DepthDetails US Patent