BDBM25581 2,6-Disubstituted Pyrazine, 26a::6-(naphthalen-2-yloxy)-N-(3,4,5-trimethoxyphenyl)pyrazin-2-amine
SMILES COc1cc(Nc2cncc(Oc3ccc4ccccc4c3)n2)cc(OC)c1OC
InChI Key InChIKey=JXIUOUKKRBMRQH-UHFFFAOYSA-N
Data  1 IC50
  Tab Delimited (TSV)   2D SDfile   Computed 3D by Vconf -m prep SDfile
Find this compound or compounds like it in BindingDB:
Activity Spreadsheet -- Enzyme Inhibition Constant Data from BindingDB
Found 1 hit for monomerid = 25581
TargetSerine/threonine-protein kinase B-raf [V600E](Homo sapiens (Human))
Cancer Research Uk Centre For Cancer Therapeutics
LigandPNGBDBM25581(2,6-Disubstituted Pyrazine, 26a | 6-(naphthalen-2-...)
Affinity DataIC50: >1.00E+5nMpH: 7.2 T: 2°C. Assay description: BRAF kinase activity was quantified using a DELFIA-based MEK1 phosphorylation assay. IC50 values were derived from the sigmoidal dose-response curves...
In DepthDetails ArticlePubMed