BDBM25582 2,6-Disubstituted Pyrazine, 27::6-phenoxy-N-(3,4,5-trimethoxyphenyl)pyrazin-2-amine
SMILES COc1cc(Nc2cncc(Oc3ccccc3)n2)cc(OC)c1OC
InChI Key InChIKey=JGFQXZNMHKPSME-UHFFFAOYSA-N
Data  1 IC50
  Tab Delimited (TSV)   2D SDfile   Computed 3D by Vconf -m prep SDfile
Find this compound or compounds like it in BindingDB:
Activity Spreadsheet -- Enzyme Inhibition Constant Data from BindingDB
Found 1 hit for monomerid = 25582
TargetSerine/threonine-protein kinase B-raf [V600E](Homo sapiens (Human))
Cancer Research Uk Centre For Cancer Therapeutics
LigandPNGBDBM25582(2,6-Disubstituted Pyrazine, 27 | 6-phenoxy-N-(3,4,...)
Affinity DataIC50:  3.10E+4nMpH: 7.2 T: 2°C. Assay description: BRAF kinase activity was quantified using a DELFIA-based MEK1 phosphorylation assay. IC50 values were derived from the sigmoidal dose-response curves...
In DepthDetails ArticlePubMed