BDBM25590 2,6-Disubstituted Pyrazine, 53::6-(quinolin-4-yloxy)-N-(3,4,5-trimethoxyphenyl)pyrazin-2-amine
SMILES COc1cc(Nc2cncc(Oc3ccnc4ccccc34)n2)cc(OC)c1OC
InChI Key InChIKey=ZYSUAIQBODJHIO-UHFFFAOYSA-N
Data  1 IC50
  Tab Delimited (TSV)   2D SDfile   Computed 3D by Vconf -m prep SDfile
Find this compound or compounds like it in BindingDB:
Activity Spreadsheet -- Enzyme Inhibition Constant Data from BindingDB
Found 1 hit for monomerid = 25590
TargetSerine/threonine-protein kinase B-raf [V600E](Homo sapiens (Human))
Cancer Research Uk Centre For Cancer Therapeutics
LigandPNGBDBM25590(2,6-Disubstituted Pyrazine, 53 | 6-(quinolin-4-ylo...)
Affinity DataIC50:  1.50E+3nM. Assay description: BRAF kinase activity was quantified using a DELFIA-based MEK1 phosphorylation assay. IC50 values were derived from the sigmoidal dose-response curves...
In DepthDetails ArticlePubMed