BDBM255976 US9481672, 154
SMILES Cn1nnc2cc(ccc12)-n1cc(C(O)=O)c(=O)n(Cc2cccc(c2Cl)C(F)(F)F)c1=O
InChI Key InChIKey=RCNDCZGZJNJIPC-UHFFFAOYSA-N
Data  1 IC50
  Tab Delimited (TSV)   2D SDfile   Computed 3D by Vconf -m prep SDfile
Find this compound or compounds like it in BindingDB:
Activity Spreadsheet -- Enzyme Inhibition Constant Data from BindingDB
Found 1 hit for monomerid = 255976
Targetchymase(Mesocricetus auratus (Golden hamster))
Bayer Pharma Aktiengesellschaft
US Patent
LigandPNGBDBM255976(US9481672, 154)
Affinity DataIC50:  4nMpH: 7.5Assay Description:The enzyme source used is recombinant human chymase (expressed in HEK293 cells) or chymase purified from hamsters' tongues. The substrate used for ch...
Ligand InfoPC cidPC sid
In DepthDetails US Patent