BDBM256011 US9481672, 189
SMILES Cn1c2ccc(cc2oc1=O)-n1cc(C(O)=O)c(=O)n([C@@H]2CCc3c2cccc3C(F)(F)F)c1=O
InChI Key InChIKey=JDARDSVOVYVQST-MRXNPFEDSA-N
Data  1 IC50
  Tab Delimited (TSV)   2D SDfile   Computed 3D by Vconf -m prep SDfile
Find this compound or compounds like it in BindingDB:
Activity Spreadsheet -- Enzyme Inhibition Constant Data from BindingDB
Found 1 hit for monomerid = 256011
Targetchymase(Mesocricetus auratus (Golden hamster))
Bayer Pharma Aktiengesellschaft
US Patent
LigandPNGBDBM256011(US9481672, 189)
Affinity DataIC50:  3nMpH: 7.5Assay Description:The enzyme source used is recombinant human chymase (expressed in HEK293 cells) or chymase purified from hamsters' tongues. The substrate used for ch...
In DepthDetails US Patent