BDBM256017 US9481672, 195
SMILES Cc1c(Cn2c(=O)c(cn(-c3ccc4n(C)c(=O)sc4c3)c2=O)C(O)=O)cccc1C(F)(F)F
InChI Key InChIKey=HJBSGFZDBUNHKW-UHFFFAOYSA-N
Data  1 IC50
  Tab Delimited (TSV)   2D SDfile   Computed 3D by Vconf -m prep SDfile
Find this compound or compounds like it in BindingDB:
Activity Spreadsheet -- Enzyme Inhibition Constant Data from BindingDB
Found 1 hit for monomerid = 256017
Targetchymase(Mesocricetus auratus (Golden hamster))
Bayer Pharma Aktiengesellschaft
US Patent
LigandPNGBDBM256017(US9481672, 195)
Affinity DataIC50:  4nMpH: 7.5Assay Description:The enzyme source used is recombinant human chymase (expressed in HEK293 cells) or chymase purified from hamsters' tongues. The substrate used for ch...
Ligand InfoPC cidPC sid
In DepthDetails US Patent