BDBM25607 2,6-Disubstituted Pyrazine, 71::6-{3-[(1Z)-1-(hydroxyimino)ethyl]phenoxy}-N-(3,4,5-trimethoxyphenyl)pyrazin-2-amine
SMILES COc1cc(Nc2cncc(Oc3cccc(c3)C(C)N=O)n2)cc(OC)c1OC
InChI Key InChIKey=ICRWWBDZEAPJSF-UHFFFAOYSA-N
Data  1 IC50
  Tab Delimited (TSV)   2D SDfile   Computed 3D by Vconf -m prep SDfile
Find this compound or compounds like it in BindingDB:
Activity Spreadsheet -- Enzyme Inhibition Constant Data from BindingDB
Found 1 hit for monomerid = 25607
TargetSerine/threonine-protein kinase B-raf [V600E](Homo sapiens (Human))
Cancer Research Uk Centre For Cancer Therapeutics
LigandPNGBDBM25607(2,6-Disubstituted Pyrazine, 71 | 6-{3-[(1Z)-1-(hyd...)
Affinity DataIC50:  1.10E+4nM. Assay description: BRAF kinase activity was quantified using a DELFIA-based MEK1 phosphorylation assay. IC50 values were derived from the sigmoidal dose-response curves...
In DepthDetails ArticlePubMed