BDBM25612 2,6-Disubstituted Pyrazine, 70::N-[5-({6-[(3,4,5-trimethoxyphenyl)amino]pyrazin-2-yl}oxy)naphthalen-1-yl]acetamide
SMILES COc1cc(Nc2cncc(Oc3cccc4c(NC(C)=O)cccc34)n2)cc(OC)c1OC
InChI Key InChIKey=CTSAUJDHCRYHOQ-UHFFFAOYSA-N
Data  1 IC50
  Tab Delimited (TSV)   2D SDfile   Computed 3D by Vconf -m prep SDfile
Find this compound or compounds like it in BindingDB:
Activity Spreadsheet -- Enzyme Inhibition Constant Data from BindingDB
Found 1 hit for monomerid = 25612
TargetSerine/threonine-protein kinase B-raf [V600E](Homo sapiens (Human))
Cancer Research Uk Centre For Cancer Therapeutics
LigandPNGBDBM25612(2,6-Disubstituted Pyrazine, 70 | N-[5-({6-[(3,4,5-...)
Affinity DataIC50:  410nM. Assay description: BRAF kinase activity was quantified using a DELFIA-based MEK1 phosphorylation assay. IC50 values were derived from the sigmoidal dose-response curves...
In DepthDetails ArticlePubMed