BDBM256200 US9487483, 52
SMILES NC(=O)c1nn(CC(=O)N2[C@@H]3C[C@@H]3C[C@H]2C(=O)NC2CCC(F)(F)C2)c2ccccc12
InChI Key InChIKey=LGKFXCHGHYVXID-OKSWLAIDSA-N
Data  1 IC50
  Tab Delimited (TSV)   2D SDfile   Computed 3D by Vconf -m prep SDfile
Find this compound or compounds like it in BindingDB:
Activity Spreadsheet -- Enzyme Inhibition Constant Data from BindingDB
Found 1 hit for monomerid = 256200
TargetComplement factor D(Homo sapiens (Human))
Novartis
US Patent
LigandPNGBDBM256200(US9487483, 52)
Affinity DataIC50:  999nMpH: 7.5 T: 2°C. Assay description: Method 1: Recombinant human factor D (expressed in E. coli and purified using standard methods) at 10 nM concentration is incubated with test compoun...
Ligand InfoPC cidPC sid
In DepthDetails US Patent