BDBM256202 US9487483, 54
SMILES CC1(C)CCC[C@H](C1)NC(=O)[C@@H]1C[C@H]2C[C@H]2N1C(=O)Cn1nc(C(N)=O)c2ccccc12
InChI Key InChIKey=PSDDFGFQSIJKQY-RGCFKVTRSA-N
Data  1 IC50
  Tab Delimited (TSV)   2D SDfile   Computed 3D by Vconf -m prep SDfile
Find this compound or compounds like it in BindingDB:
Activity Spreadsheet -- Enzyme Inhibition Constant Data from BindingDB
Found 1 hit for monomerid = 256202
TargetComplement factor D(Homo sapiens (Human))
Novartis
US Patent
LigandPNGBDBM256202(US9487483, 54)
Affinity DataIC50:  57nMpH: 7.5 T: 2°C. Assay description: Method 1: Recombinant human factor D (expressed in E. coli and purified using standard methods) at 10 nM concentration is incubated with test compoun...
Ligand InfoPC cidPC sid
In DepthDetails US Patent