BDBM256224 US9487483, 76
SMILES NC(=O)c1nn(CC(=O)N2[C@@H]3C[C@@H]3C[C@H]2C(=O)N[C@H]2CCCC3(CC3)C2)c2cnccc12
InChI Key InChIKey=QGGPWWBKUIIOTO-WTTBNOFXSA-N
Data  1 IC50
  Tab Delimited (TSV)   2D SDfile   Computed 3D by Vconf -m prep SDfile
Find this compound or compounds like it in BindingDB:
Activity Spreadsheet -- Enzyme Inhibition Constant Data from BindingDB
Found 1 hit for monomerid = 256224
TargetComplement factor D(Homo sapiens (Human))
Novartis
US Patent
LigandPNGBDBM256224(US9487483, 76)
Affinity DataIC50:  156nMpH: 7.5 T: 2°C. Assay description: Method 1: Recombinant human factor D (expressed in E. coli and purified using standard methods) at 10 nM concentration is incubated with test compoun...
Ligand InfoPC cidPC sid
In DepthDetails US Patent