BDBM256301 US9487488, 25
SMILES Cc1n[nH]c(n1)-c1ccc(cc1)S(=O)(=O)N(Cc1ccc(cn1)C(F)(F)F)c1ncc2ccccc2c1C1CC1
InChI Key InChIKey=PNLUUTKLCRQVPO-UHFFFAOYSA-N
Data  1 IC50
  Tab Delimited (TSV)   2D SDfile   Computed 3D by Vconf -m prep SDfile
Find this compound or compounds like it in BindingDB:
Activity Spreadsheet -- Enzyme Inhibition Constant Data from BindingDB
Found 1 hit for monomerid = 256301
TargetTransient receptor potential cation channel subfamily M member 8(Homo sapiens (Human))
Mitsubishi Tanabe Pharma
US Patent
LigandPNGBDBM256301(US9487488, 25)
Affinity DataIC50:  0.700nMT: 2°C. Assay description: The functional activity of a test compound was determined by measuring change in intracellular calcium concentration using a calcium sensitive fluore...
Ligand InfoPC cidPC sid
In DepthDetails US Patent