BDBM256384 US9487490, 7B
SMILES C[C@@]1(CC[C@@H](CC1)C(O)=O)c1nn(C(=O)c2c(Cl)cccc2C(F)(F)F)c2cccc(F)c12
InChI Key InChIKey=CHMFHAIDDKZQQX-ZCNVGUKTSA-N
Data  1 IC50
  Tab Delimited (TSV)   2D SDfile   Computed 3D by Vconf -m prep SDfile
Find this compound or compounds like it in BindingDB:
Activity Spreadsheet -- Enzyme Inhibition Constant Data from BindingDB
Found 1 hit for monomerid = 256384
TargetIsoform 2 of Nuclear receptor ROR-gamma (RORgT)(Homo sapiens (Human))
Merck Sharp & Dohme
US Patent
LigandPNGBDBM256384(US9487490, 7B)
Affinity DataIC50:  663nMpH: 7.0 T: 2°C. Assay description: To identify novel antagonists of RORgammaT, an assay was developed which employs the interaction of RORgammaT with its co-activator peptide SRC1_2. T...
Ligand InfoPC cidPC sid
In DepthDetails US Patent