BDBM256509 US9481648, 7
SMILES COCCOCCOCCNC(=O)c1cc(Nc2nccc(Oc3ccc(NC(=O)Nc4cc(cc(NS(C)(=O)=O)c4OC)C(C)(C)C)c4ccccc34)n2)cc(OC)c1
InChI Key InChIKey=YDOGVCSSPRAZDJ-UHFFFAOYSA-N
Data  4 IC50
  Tab Delimited (TSV)   2D SDfile   Computed 3D by Vconf -m prep SDfile
Find this compound or compounds like it in BindingDB:
Activity Spreadsheet -- Enzyme Inhibition Constant Data from BindingDB
Found 4 hits for monomerid = 256509
TargetMitogen-activated protein kinase 14(Homo sapiens (Human))
Respivert
US Patent
LigandPNGBDBM256509(US9481648, 7)
Affinity DataIC50:  39nM. Assay description: Method 2: This method follows the same steps as Method 1 above, but utilises a higher concentration of the p38 MAPKα protein (2.5 uL of 200 ng/...
Ligand InfoPC cidPC sid
In DepthDetails US Patent
TargetGlycogen synthase kinase-3 alpha(Homo sapiens (Human))
Respivert
US Patent
LigandPNGBDBM256509(US9481648, 7)
Affinity DataIC50:  516nM. Assay description: Method 2: This method follows the same steps as Method 1 above, but utilises a shorter period of mixing of the test compound (105 minutes instead of ...
Ligand InfoPC cidPC sid
In DepthDetails US Patent
TargetTyrosine-protein kinase SYK(Homo sapiens (Human))
Respivert
US Patent
LigandPNGBDBM256509(US9481648, 7)
Affinity DataIC50:  554nM. Assay description: The inhibitory activities of compounds of the invention against c-Src and Syk enzymes (Invitrogen), are evaluated in a similar fashion to that descri...
Ligand InfoPC cidPC sid
In DepthDetails US Patent
TargetProto-oncogene tyrosine-protein kinase Src(Homo sapiens (Human))
Respivert
US Patent
LigandPNGBDBM256509(US9481648, 7)
Affinity DataIC50:  9nM. Assay description: The inhibitory activities of compounds of the invention against c-Src and Syk enzymes (Invitrogen), are evaluated in a similar fashion to that descri...
Ligand InfoPC cidPC sid
In DepthDetails US Patent