BDBM256525 US10435361, Example 24::US9481648, 24::US9790174, Example 24
SMILES COCCOCCOCCOc1cc(Nc2nccc(Oc3ccc(NC(=O)Nc4cc(NS(C)(=O)=O)cc(c4)C(C)(C)C)c4ccccc34)n2)cc(OC)c1
InChI Key InChIKey=PUDBISUVQGIKBD-UHFFFAOYSA-N
Data  8 IC50
  Tab Delimited (TSV)   2D SDfile   Computed 3D by Vconf -m prep SDfile
Find this compound or compounds like it in BindingDB:
Activity Spreadsheet -- Enzyme Inhibition Constant Data from BindingDB
Found 8 hits for monomerid = 256525
TargetMitogen-activated protein kinase 14(Homo sapiens (Human))
Respivert
US Patent
LigandPNGBDBM256525(US10435361, Example 24 | US9481648, 24 | US9790174...)
Affinity DataIC50:  30nM. Assay description: Method 2: This method follows the same steps as Method 1 above, but utilises a higher concentration of the p38 MAPKα protein (2.5 uL of 200 ng/...
Ligand InfoPC cidPC sid
In DepthDetails US Patent
TargetProto-oncogene tyrosine-protein kinase Src(Homo sapiens (Human))
Respivert
US Patent
LigandPNGBDBM256525(US10435361, Example 24 | US9481648, 24 | US9790174...)
Affinity DataIC50:  14nM. Assay description: The inhibitory activities of compounds of the invention against c-Src and Syk enzymes (Invitrogen), are evaluated in a similar fashion to that descri...
Ligand InfoPC cidPC sid
In DepthDetails US Patent
TargetTyrosine-protein kinase SYK(Homo sapiens (Human))
Respivert
US Patent
LigandPNGBDBM256525(US10435361, Example 24 | US9481648, 24 | US9790174...)
Affinity DataIC50:  549nM. Assay description: The inhibitory activities of compounds of the invention against c-Src and Syk enzymes (Invitrogen), are evaluated in a similar fashion to that descri...
Ligand InfoPC cidPC sid
In DepthDetails US Patent
TargetGlycogen synthase kinase-3 alpha(Homo sapiens (Human))
Respivert
US Patent
LigandPNGBDBM256525(US10435361, Example 24 | US9481648, 24 | US9790174...)
Affinity DataIC50:  680nM. Assay description: The inhibitory activities of compounds of the invention against the GSK 3α enzyme isoform (Invitrogen), are evaluated by determining the level o...
Ligand InfoPC cidPC sid
In DepthDetails US Patent
TargetMitogen-activated protein kinase 14(Homo sapiens (Human))
Respivert
US Patent
LigandPNGBDBM256525(US10435361, Example 24 | US9481648, 24 | US9790174...)
Affinity DataIC50:  30nM. Assay description: The following two assay variants can be used for determination of p38 MAPKα inhibition.Method 1The inhibitory activities of test compounds again...
Ligand InfoPC cidPC sid
In DepthDetails US Patent
TargetProto-oncogene tyrosine-protein kinase Src(Homo sapiens (Human))
Respivert
US Patent
LigandPNGBDBM256525(US10435361, Example 24 | US9481648, 24 | US9790174...)
Affinity DataIC50:  14nM. Assay description: The inhibitory activities of compounds of the invention against c-Src and Syk enzymes (Invitrogen), are evaluated in a similar fashion to that descri...
Ligand InfoPC cidPC sid
In DepthDetails US Patent
TargetTyrosine-protein kinase SYK(Homo sapiens (Human))
Respivert
US Patent
LigandPNGBDBM256525(US10435361, Example 24 | US9481648, 24 | US9790174...)
Affinity DataIC50:  549nM. Assay description: The inhibitory activities of compounds of the invention against c-Src and Syk enzymes (Invitrogen), are evaluated in a similar fashion to that descri...
Ligand InfoPC cidPC sid
In DepthDetails US Patent
TargetGlycogen synthase kinase-3 alpha(Homo sapiens (Human))
Respivert
US Patent
LigandPNGBDBM256525(US10435361, Example 24 | US9481648, 24 | US9790174...)
Affinity DataIC50:  680nM. Assay description: Method 2: This method follows the same steps as Method 1 above, but utilises a shorter period of mixing of the test compound (105 minutes instead of ...
Ligand InfoPC cidPC sid
In DepthDetails US Patent