BDBM256628 US10053456, 7::US10414761, Example 7::US10968213, Example 7::US9487511, 7::US9718814, 7::US9920047, 7
SMILES Cc1nnc(NC(=O)c2cc(C3CC3NCC3CC3)c3ccccc3c2)s1
InChI Key InChIKey=ZSDGWAKTDYTEID-UHFFFAOYSA-N
Data  21 IC50
  Tab Delimited (TSV)   2D SDfile   Computed 3D by Vconf -m prep SDfile
Find this compound or compounds like it in BindingDB:
Activity Spreadsheet -- Enzyme Inhibition Constant Data from BindingDB
Found 21 hits for monomerid = 256628
TargetGlutathione S-transferase P/Lysine-specific histone demethylase 1A [172-833](Homo sapiens (Human))
Takeda Pharmaceutical
US Patent
LigandPNGBDBM256628(US10053456, 7 | US10414761, Example 7 | US10968213...)
Affinity DataIC50:  260nMpH: 8.0 T: 2°C. Assay description: A test compound dissolved in DMSO was added by to a reaction solution (50 mM Tris-HCl (pH 8.0), 0.1% BSA, 1 mM DTT) containing LSD1 enzyme, and the m...
Ligand InfoPC cidPC sid
In DepthDetails US Patent
TargetAmine oxidase [flavin-containing] B(Homo sapiens (Human))
Takeda Pharmaceutical
US Patent
LigandPNGBDBM256628(US10053456, 7 | US10414761, Example 7 | US10968213...)
Affinity DataIC50: >1.00E+5nM. Assay description: The MAO-B inhibitory activity evaluation described below followed the protocol of MAO-Glo (registered trademark) Assay of Promega KK.A test compound ...
Ligand InfoPC cidPC sid
In DepthDetails US Patent
TargetAmine oxidase [flavin-containing] B(Homo sapiens (Human))
Takeda Pharmaceutical
US Patent
LigandPNGBDBM256628(US10053456, 7 | US10414761, Example 7 | US10968213...)
Affinity DataIC50: >1.00E+5nMpH: 7.5 T: 2°C. Assay description: The MAO-B inhibitory activity evaluation described below followed the protocol of MAO-Glo (registered trademark) Assay of Promega KK. A test compound...
Ligand InfoPC cidPC sid
In DepthDetails US Patent
TargetLysine-specific histone demethylase 1A(Homo sapiens (Human))
Takeda Pharmaceutical
US Patent
LigandPNGBDBM256628(US10053456, 7 | US10414761, Example 7 | US10968213...)
Affinity DataIC50:  260nMpH: 8.0 T: 2°C. Assay description: A test compound dissolved in DMSO was added by to a reaction solution (50 mM Tris-HCl (pH 8.0), 0.1% BSA, 1 mM DTT) containing LSD1 enzyme, and the m...
Ligand InfoPC cidPC sid
In DepthDetails US Patent
TargetAmine oxidase [flavin-containing] A(Homo sapiens (Human))
Takeda Pharmaceutical
US Patent
LigandPNGBDBM256628(US10053456, 7 | US10414761, Example 7 | US10968213...)
Affinity DataIC50:  8.20E+4nMpH: 7.5 T: 2°C. Assay description: A test compound dissolved in DMSO was added to a reaction solution (100 mM HEPES (pH 7.5), 5% glycerol) containing MAO-A enzyme (Sigma-Aldrich Co. LL...
Ligand InfoPC cidPC sid
In DepthDetails US Patent
TargetAmine oxidase [flavin-containing] B(Homo sapiens (Human))
Takeda Pharmaceutical
US Patent
LigandPNGBDBM256628(US10053456, 7 | US10414761, Example 7 | US10968213...)
Affinity DataIC50: >1.00E+5nMpH: 7.5 T: 2°C. Assay description: A test compound dissolved in DMSO was added to a reaction solution (100 mM HEPES (pH 7.5), 5% glycerol, 10% DMSO) containing MAO-B enzyme (Sigma-Aldr...
Ligand InfoPC cidPC sid
In DepthDetails US Patent
TargetLysine-specific histone demethylase 1A(Homo sapiens (Human))
Takeda Pharmaceutical
US Patent
LigandPNGBDBM256628(US10053456, 7 | US10414761, Example 7 | US10968213...)
Affinity DataIC50:  260nMpH: 8.0 T: 2°C. Assay description: A test compound dissolved in DMSO was added by to a reaction solution (50 mM Tris-HCl (pH 8.0), 0.1% BSA, 1 mM DTT) containing LSD1 enzyme, and the m...
Ligand InfoPC cidPC sid
In DepthDetails US Patent
TargetAmine oxidase [flavin-containing] A(Homo sapiens (Human))
Takeda Pharmaceutical
US Patent
LigandPNGBDBM256628(US10053456, 7 | US10414761, Example 7 | US10968213...)
Affinity DataIC50:  8.20E+4nMpH: 7.5 T: 2°C. Assay description: The MAO-A inhibitory activity evaluation described below followed the protocol of MAO-Glo (registered trademark) Assay of Promega KK.A test compound ...
Ligand InfoPC cidPC sid
In DepthDetails US Patent
TargetAmine oxidase [flavin-containing] B(Homo sapiens (Human))
Takeda Pharmaceutical
US Patent
LigandPNGBDBM256628(US10053456, 7 | US10414761, Example 7 | US10968213...)
Affinity DataIC50: >1.00E+5nMpH: 7.5 T: 2°C. Assay description: The MAO-B inhibitory activity evaluation described below followed the protocol of MAO-Glo (registered trademark) Assay of Promega KK.A test compound ...
Ligand InfoPC cidPC sid
In DepthDetails US Patent
TargetLysine-specific histone demethylase 1A(Homo sapiens (Human))
Takeda Pharmaceutical
US Patent
LigandPNGBDBM256628(US10053456, 7 | US10414761, Example 7 | US10968213...)
Affinity DataIC50:  260nMpH: 8.0 T: 2°C. Assay description: A test compound dissolved in DMSO was added by to a reaction solution (50 mM Tris-HCl (pH 8.0), 0.1% BSA, 1 mM DTT) containing LSD1 enzyme, and the m...
Ligand InfoPC cidPC sid
In DepthDetails US Patent
TargetAmine oxidase [flavin-containing] A(Homo sapiens (Human))
Takeda Pharmaceutical
US Patent
LigandPNGBDBM256628(US10053456, 7 | US10414761, Example 7 | US10968213...)
Affinity DataIC50:  8.20E+4nMpH: 7.5 T: 2°C. Assay description: The MAO-A inhibitory activity evaluation described below followed the protocol of MAO-Glo (registered trademark) Assay of Promega KK.A test compound ...
Ligand InfoPC cidPC sid
In DepthDetails US Patent
TargetAmine oxidase [flavin-containing] B(Homo sapiens (Human))
Takeda Pharmaceutical
US Patent
LigandPNGBDBM256628(US10053456, 7 | US10414761, Example 7 | US10968213...)
Affinity DataIC50: >1.00E+5nMpH: 7.5 T: 2°C. Assay description: The MAO-B inhibitory activity evaluation described below followed the protocol of MAO-Glo (registered trademark) Assay of Promega KK.A test compound ...
Ligand InfoPC cidPC sid
In DepthDetails US Patent
TargetLysine-specific histone demethylase 1A(Homo sapiens (Human))
Takeda Pharmaceutical
US Patent
LigandPNGBDBM256628(US10053456, 7 | US10414761, Example 7 | US10968213...)
Affinity DataIC50:  260nM. Assay description: A test compound dissolved in DMSO was added by to a reaction solution (50 mM Tris-HCl (pH 8.0), 0.1% BSA, 1 mM DTT) containing LSD1 enzyme, and the m...
Ligand InfoPC cidPC sid
In DepthDetails US Patent
TargetAmine oxidase [flavin-containing] A(Homo sapiens (Human))
Takeda Pharmaceutical
US Patent
LigandPNGBDBM256628(US10053456, 7 | US10414761, Example 7 | US10968213...)
Affinity DataIC50:  8.20E+4nM. Assay description: A test compound dissolved in DMSO was added to a reaction solution (100 mM HEPES (pH 7.5), 5% glycerol) containing MAO-A enzyme (Sigma-Aldrich Co. LL...
Ligand InfoPC cidPC sid
In DepthDetails US Patent
TargetAmine oxidase [flavin-containing] B(Homo sapiens (Human))
Takeda Pharmaceutical
US Patent
LigandPNGBDBM256628(US10053456, 7 | US10414761, Example 7 | US10968213...)
Affinity DataIC50: >1.00E+5nM. Assay description: A test compound dissolved in DMSO was added to a reaction solution (100 mM HEPES (pH 7.5), 5% glycerol, 10% DMSO) containing MAO-B enzyme (Sigma-Aldr...
Ligand InfoPC cidPC sid
In DepthDetails US Patent
TargetLysine-specific histone demethylase 1A(Homo sapiens (Human))
Takeda Pharmaceutical
US Patent
LigandPNGBDBM256628(US10053456, 7 | US10414761, Example 7 | US10968213...)
Affinity DataIC50:  260nM. Assay description: LSD1: A test compound dissolved in DMSO was added by to a reaction solution (50 mM Tris-HCl (pH 8.0), 0.1% BSA, 1 mM DTT) containing LSD1 enzyme, and...
Ligand InfoPC cidPC sid
In DepthDetails US Patent
TargetAmine oxidase [flavin-containing] A(Homo sapiens (Human))
Takeda Pharmaceutical
US Patent
LigandPNGBDBM256628(US10053456, 7 | US10414761, Example 7 | US10968213...)
Affinity DataIC50:  8.20E+4nM. Assay description: MAO-A: The MAO-A inhibitory activity evaluation described below followed the protocol of MAO-Glo (registered trademark) Assay of Promega KK.A test co...
Ligand InfoPC cidPC sid
In DepthDetails US Patent
TargetAmine oxidase [flavin-containing] B(Homo sapiens (Human))
Takeda Pharmaceutical
US Patent
LigandPNGBDBM256628(US10053456, 7 | US10414761, Example 7 | US10968213...)
Affinity DataIC50: >1.00E+5nM. Assay description: MAO-B: The MAO-B inhibitory activity evaluation described below followed the protocol of MAO-Glo (registered trademark) Assay of Promega KK.A test co...
Ligand InfoPC cidPC sid
In DepthDetails US Patent
TargetLysine-specific histone demethylase 1A(Homo sapiens (Human))
Takeda Pharmaceutical
US Patent
LigandPNGBDBM256628(US10053456, 7 | US10414761, Example 7 | US10968213...)
Affinity DataIC50:  260nM. Assay description: LSD1: A test compound dissolved in DMSO was added by to a reaction solution (50 mM Tris-HCl (pH 8.0), 0.1% BSA, 1 mM DTT) containing LSD1 enzyme, and...
Ligand InfoPC cidPC sid
In DepthDetails US Patent
TargetAmine oxidase [flavin-containing] A(Homo sapiens (Human))
Takeda Pharmaceutical
US Patent
LigandPNGBDBM256628(US10053456, 7 | US10414761, Example 7 | US10968213...)
Affinity DataIC50:  8.20E+4nM. Assay description: The MAO-A inhibitory activity evaluation described below followed the protocol of MAO-Glo (registered trademark) Assay of Promega KK.A test compound ...
Ligand InfoPC cidPC sid
In DepthDetails US Patent
TargetAmine oxidase [flavin-containing] A(Homo sapiens (Human))
Takeda Pharmaceutical
US Patent
LigandPNGBDBM256628(US10053456, 7 | US10414761, Example 7 | US10968213...)
Affinity DataIC50:  8.20E+4nMpH: 7.5 T: 2°C. Assay description: The MAO-A inhibitory activity evaluation described below followed the protocol of MAO-Glo (registered trademark) Assay of Promega KK.A test compound ...
Ligand InfoPC cidPC sid
In DepthDetails US Patent