BDBM256670 US9487511, 49
SMILES Cc1nnc(NC(=O)c2csc(c2)[C@H]2C[C@H]2NC2CCOCC2)s1
InChI Key InChIKey=NELDJPIPYKJYET-QWHCGFSZSA-N
Data  3 IC50
  Tab Delimited (TSV)   2D SDfile   Computed 3D by Vconf -m prep SDfile
Find this compound or compounds like it in BindingDB:
Activity Spreadsheet -- Enzyme Inhibition Constant Data from BindingDB
Found 3 hits for monomerid = 256670
TargetGlutathione S-transferase P/Lysine-specific histone demethylase 1A [172-833](Homo sapiens (Human))
Takeda Pharmaceutical
US Patent
LigandPNGBDBM256670(US9487511, 49)
Affinity DataIC50: <100nMpH: 8.0 T: 2°C. Assay description: A test compound dissolved in DMSO was added by to a reaction solution (50 mM Tris-HCl (pH 8.0), 0.1% BSA, 1 mM DTT) containing LSD1 enzyme, and the m...
Ligand InfoPC cidPC sid
In DepthDetails US Patent
TargetAmine oxidase [flavin-containing] B(Homo sapiens (Human))
Takeda Pharmaceutical
US Patent
LigandPNGBDBM256670(US9487511, 49)
Affinity DataIC50: >1.00E+5nMpH: 7.5 T: 2°C. Assay description: The MAO-B inhibitory activity evaluation described below followed the protocol of MAO-Glo (registered trademark) Assay of Promega KK. A test compound...
Ligand InfoPC cidPC sid
In DepthDetails US Patent
TargetAmine oxidase [flavin-containing] A(Homo sapiens (Human))
Takeda Pharmaceutical
US Patent
LigandPNGBDBM256670(US9487511, 49)
Affinity DataIC50: >1.00E+5nMpH: 7.5 T: 2°C. Assay description: The MAO-A inhibitory activity evaluation described below followed the protocol of MAO-Glo (registered trademark) Assay of Promega KK.A test compound ...
Ligand InfoPC cidPC sid
In DepthDetails US Patent