BDBM256790 US9489013, 61
SMILES COc1ccc(nc1)C(=O)Nc1ccc(F)c(c1)[C@@]1(C)NC(=N)N(C)S(=O)(=O)[C@@]11CCN(C1)S(=O)(=O)c1cn(C)cn1
InChI Key InChIKey=WVNQOOTXZPUPBE-JWQCQUIFSA-N
Data  2 KI
  Tab Delimited (TSV)   2D SDfile   Computed 3D by Vconf -m prep SDfile
Find this compound or compounds like it in BindingDB:
Activity Spreadsheet -- Enzyme Inhibition Constant Data from BindingDB
Found 2 hits for monomerid = 256790
TargetBeta-secretase 1(Homo sapiens (Human))
Merck Sharp & Dohme
US Patent
LigandPNGBDBM256790(US9489013, 61)
Affinity DataKi:  6nM ΔG°:  -11.4kcal/molepH: 5.0 T: 2°C. Assay description: A homogeneous time-resolved FRET assay can be used to determine IC50 values for inhibitors of the soluble human BACE1 catalytic domain. This assay mo...
Ligand InfoPC cidPC sid
In DepthDetails US Patent
TargetBeta-secretase 2(Homo sapiens (Human))
Merck Sharp & Dohme
US Patent
LigandPNGBDBM256790(US9489013, 61)
Affinity DataKi:  38nM ΔG°:  -10.3kcal/molepH: 5.0 T: 2°C. Assay description: Inhibitor IC50's at purified human autoBACE-2 are determined in a time-resolved endpoint proteolysis assay that measures hydrolysis of the QSY7-EISEV...
Ligand InfoPC cidPC sid
In DepthDetails US Patent