BDBM256810 US9489013, 81
SMILES CN1C(=N)N[C@](C)(c2cc(NC(=O)c3ccc(F)cn3)ccc2F)[C@]2(CCN(C2)S(=O)(=O)c2cn(C)cn2)S1(=O)=O
InChI Key InChIKey=YFFYIHMPFQKDII-DNQXCXABSA-N
Data  2 KI
  Tab Delimited (TSV)   2D SDfile   Computed 3D by Vconf -m prep SDfile
Find this compound or compounds like it in BindingDB:
Activity Spreadsheet -- Enzyme Inhibition Constant Data from BindingDB
Found 2 hits for monomerid = 256810
TargetBeta-secretase 1(Homo sapiens (Human))
Merck Sharp & Dohme
US Patent
LigandPNGBDBM256810(US9489013, 81)
Affinity DataKi:  8nM ΔG°:  -11.2kcal/molepH: 5.0 T: 2°C. Assay description: A homogeneous time-resolved FRET assay can be used to determine IC50 values for inhibitors of the soluble human BACE1 catalytic domain. This assay mo...
Ligand InfoPC cidPC sid
In DepthDetails US Patent
TargetBeta-secretase 2(Homo sapiens (Human))
Merck Sharp & Dohme
US Patent
LigandPNGBDBM256810(US9489013, 81)
Affinity DataKi:  24nM ΔG°:  -10.6kcal/molepH: 5.0 T: 2°C. Assay description: Inhibitor IC50's at purified human autoBACE-2 are determined in a time-resolved endpoint proteolysis assay that measures hydrolysis of the QSY7-EISEV...
Ligand InfoPC cidPC sid
In DepthDetails US Patent